{"text_format":"1","workbook":"xlsx","n_sheets":3,"sheets":["Configuracion","Datos","Cronograma"],"not_rendered":{"charts":0,"images":1,"macros":1,"external_links":1,"defined_names":26,"comments":1,"pivot_tables":0},"unopened":[],"bounds":{"document_bytes":16777216,"sheet_cells":100000,"rows_first":2000,"rows_last":500,"rows_between":2000,"halvings":0,"cell_chars":16384,"cell_head_chars":4096},"cells_cut":0,"cells_raw":0,"read":"whole","date_system":"1900"}

{"sheet":"Configuracion","index":0,"n_rows":59,"n_cols":11,"rows_kept":59,"cut":false,"hidden":false,"merged":[[2,4,2,7]]}
[]
[]
[null,"Moneda",null,null,"Importe Seguro de Desempleo",null,null,null,null,null,"Período de gracia"]
[1,"Soles",null,null,"Moneda","Meses(desde)","Meses(hasta)","Importe",null,0,0]
[2,"Dólares",null,null,1,1,6,73,null,1,1]
[null,null,null,null,1,7,9,110,null,2,2]
[null,"Cuotas",null,null,1,10,12,145]
[1,"Ordinarias",null,null,1,13,18,185]
[2,"Extraordinarias",null,null,1,19,24,252,null,null,"Plazo"]
[null,null,null,null,1,25,36,369,null,0,6]
[null,"Mes siguiente",null,null,1,37,48,454,null,1,12]
[1,"SI",null,null,1,49,999,577,null,2,18]
[2,"NO",null,null,2,1,6,34,null,3,24]
[null,null,null,null,2,7,9,51,null,4,36]
[null,"Día Vencimiento",null,null,2,10,12,68,null,5,48]
[1,2,null,null,2,13,18,88,null,6,60]
[2,17,null,null,2,19,24,120]
[null,null,null,null,2,25,36,176]
[null,"Seguro de Protección de Créditos",null,null,2,37,48,186]
[1,"SI",null,null,2,49,999,236]
[2,"NO"]
[null,null,null,null,"Comisión Informe"]
[null,"Comisión de informe",null,null,"Soles",10]
[1,"SI",null,null,"Dólares",3.5]
[2,"NO"]
[]
[null,"Seguro Desgravamen"]
[1,"INDIVIDUAL",7.5000000000000002E-4]
[2,"ENDOSADO",0]
[]
[]
[]
[]
[]
[]
[1,"Enero"]
[{"$f":"+A36+1","v":2},"Febrero"]
[{"$f":"+A37+1","v":3},"Marzo"]
[4,"Abril"]
[5,"Mayo"]
{"$rows_left_out":20}
{"sheet":"Datos","index":1,"n_rows":34,"n_cols":24,"rows_kept":34,"cut":false,"hidden":false,"merged":[[4,1,4,3],[8,2,8,5]]}
[null,null,null,null,null,null,null,null,null,null,null,null,null,null,null,null,null,null,null,null,null,null,null,"2019-01-01"]
[null,null,null,null,null,null,null,null,null,null,null,null,null,null,null,null,null,null,null,null,null,null,null,"2019-01-31"]
[]
["Simulador de Préstamo Personal"]
[]
[]
[null,"Moneda del Préstamo",null,1,null,null,null,null,null,{"$f":"IF(FEC_DES<J18,1,0)","v":1}]
[]
[]
[null,null,null,null,null,null,null,null,null,"Monto Desembolso",{"$f":"C12+C23","v":5577}]
[null,null,null,null,null,{"$f":"IF(C12>20000, \"Si el cliente tiene correo\", \"\")","v":""}]
[null,"¿Qué importe desea solicitar?",5000,null,null,{"$f":"IF(C12>20000, \"OFRECE PAPERLESS\", \"\")","v":""},null,null,null,null,"TED","TEM"]
[null,"¿En cuantos meses desea pagar?",60,null,null,null,null,null,null,"TEA",{"$f":"(1+C15)^(1/360)-1","v":5.0634542733418719E-4},{"$f":"(1+C15)^(1/12)-1","v":1.5302419470205164E-2}]
[null,"¿Necesita Periodo de Gracia adicional?",0,null,null,null,null,null,null,"Seg. Desgrav.",{"$f":"(1+E16)^(1/30)-1","v":2.4990941953184631E-5},{"$f":"E16","v":7.5000000000000002E-4}]
[null,"Tasa Interés Efectiva Anual",0.19989999999999999,null,null,null,null,null,null,null,{"$f":"(1+TEM)^(1/30)-1","v":5.3097230898724312E-4},{"$f":"L13+L14","v":1.6052419470205165E-2}]
[null,"Seguro de Desgravamen",null,1,{"$f":"IF(D16=1,Configuracion!C28,Configuracion!C29)","v":7.5000000000000002E-4}]
[null,"Tipo de Cuota",null,1,null,null,null,null,null,"Fec. Cercana","1era Fecha","Dias 1era Fec"]
[null,"Fecha de Desembolso",{"$f":"+TODAY()","v":"2022-01-26"},2,null,null,{"$f":"E20","v":17},{"$f":"MONTH(FEC_DES)","v":1},{"$f":"YEAR(FEC_DES)","v":2022},{"$f":"IF(DATE(I18,H18,E20)<FEC_DES,DATE(I18,H18+1,G18),DATE(I18,H18,E20))","v":"2022-02-17"},{"$f":"IF(D19=2,IF(OR(DAY(FEC_DES)=E20, J18-FEC_DES<30),EDATE(J18,1), J18),FEC_DES+E19)","v":"2022-03-17"},{"$f":"K18-FEC_DES","v":50}]
[null,"Vencimiento Mes siguiente",null,2,30,null,null,null,null,{"$f":"J18-FEC_DES","v":22}]
[null,"Fecha de pago",null,2,{"$f":"IF(D20=1,Configuracion!B16,Configuracion!B17)","v":17},null,null,null,null,"Fec. Des. Ini. Gr.",{"$f":"FEC_DES","v":"2022-01-26"}]
[null,"Fecha 1er Pago",{"$f":"EDATE(K18,MESES_GRACIA)","v":"2022-03-17"},2,null,null,null,null,null,"Fec. Des. Ini. Nr.",{"$f":"IF(FEC_PRIMER_PAGO-K18=0,FEC_DES,K18)","v":"2022-01-26"}]
[null,"Seguro de Protección de créditos",null,1]
[null,"Costo de Seguro de Protección de Créditos",{"$f":"IF(D22=1,$K$28,0)","v":577},1,null,null,null,null,null,"Prestamo",{"$f":"K10","v":5577}]
[null,"Comisión envío de informe de pago físico",null,2,{"$f":"IF(D24=1,(IF(D7=1,Configuracion!F23,Configuracion!F24)),0)","v":0},null,null,null,null,"Saldo Capit.",{"$f":"VLOOKUP(\"PP\",Cronograma!B32:I127,8,FALSE)","v":5642.5240052307472}]
[null,null,{"$f":"IFERROR(C23/PLAZO,\"\")","v":9.6166666666666671},null,null,null,null,null,null,"FVP",{"$f":"SUM(Cronograma!H32:H127)","v":38.136546228821089}]
[null,"Cuota mensual",{"$f":"+Cronograma!$S$1","v":147.95582094338945},null,null,null,null,null,null,"Cuota",{"$f":"K24/K25","v":147.95582094338945}]
[]
[null,null,null,null,null,null,null,null,null,null,577,null,null,577]
[null,"Si deseas revisar el detalle de las cuotas puedes revisar"]
[null,"el cronograma dando click aquí"]
[null,null,null,null,null,null,null,null,null,"Monto Seguro",143]
[]
[null,null,null,null,null,null,null,null,null,"TCEA",{"$f":"+(K34+1)^12-1","v":0.22016186438093377},{"$f":"+(L34+1)^12-1","v":0.22016186438093377},{"$f":"+K33-L33","v":0}]
[null,null,null,null,null,null,null,null,null,null,{"$f":"IRR(Cronograma!AA31:'Cronograma'!AA127,0.01)","v":1.6720204239281555E-2},{"$f":"IRR(Cronograma!AB31:'Cronograma'!AB127,0.01)","v":1.6720204239281555E-2}]

{"sheet":"Cronograma","index":2,"n_rows":144,"n_cols":28,"rows_kept":144,"cut":false,"hidden":false,"merged":[[1,3,1,19],[13,3,13,8],[12,3,12,8],[16,3,16,8],[26,3,26,20],[135,11,136,18],[138,11,138,18],[140,11,140,18],[143,11,143,18],[145,11,145,18]]}
[null,null,null,null,null,null,null,null,null,null,null,null,null,null,null,null,null,null,{"$f":"SMALL(S32:S37,3)","v":147.95582094338945},{"$f":"LARGE(S32:S37,1)","v":147.95582094338945}]
[null,null,null,"SIMULACIÓN PRÉSTAMO PERSONAL"]
[]
[]
[null,null,null,"CLIENTE",null,null,null,null,null,":",null,{"$f":"Datos!C9","v":0}]
[]
[null,null,null,"TASA DE INTERES COMPENSATORIA"]
[null,null,null," - EFECTIVA ANUAL FIJA",null,null,null,null,null,":",null,{"$f":"Datos!C15","v":0.19989999999999999}]
[null,null,null," - TASA DE COSTO EFECTIVO ANUAL",null,null,null,null,null,":",null,{"$f":"Datos!K33","v":0.22016186438093377}]
[]
[null,null,null,"NRO CUOTAS MENSUALES",null,null,null,null,null,":",null,{"$f":"CONCATENATE(PLAZO, \" MESES\")","v":"60 MESES"}]
[null,null,null,"MONTO DE CREDITO",null,null,null,null,null,":",null,{"$f":"CONCATENATE(IF(Datos!D7=1,\"S/\",\"$\"),TEXT(Datos!K23,\"#,##0.00\"))","v":"S/5,577.00"},null,null,null,null,null,null,null,null,null,null,{"$f":"Datos!K23","v":5577}]
[null,null,null,{"$f":"CONCATENATE(\"PERIODO DE GRACIA (\",W17,\" DIAS)\")","v":"PERIODO DE GRACIA (22 DIAS)"},null,null,null,null,null,":",null,{"$f":"CONCATENATE(IF(Datos!D7=1,\"S/\",\"$\"),TEXT(W13,\"#,##0.00\"))","v":"S/65.52"},null,null,null,null,null,null,null,null,null,null,{"$f":"W18","v":65.524005230746795}]
[null,null,null,"SEGURO PROTECCION FINANCIERA",null,null,null,null,null,":",null,{"$f":"CONCATENATE(IF(Datos!D7=1,\"S/\",\"$\"),TEXT(Datos!C23,\"#,##0.00\"))","v":"S/577.00"}]
[null,null,null,"TOTAL FINANCIADO",null,null,null,null,null,":",null,{"$f":"CONCATENATE(IF(Datos!D7=1,\"S/\",\"$\"),TEXT(W12+W13,\"#,##0.00\"))","v":"S/5,642.52"}]
[null,null,null,null,null,null,null,null,null,null,null,null,null,null,null,null,null,null,null,null,null,"Ocultar Dias Gracia",{"$f":"IF(F31=0,\"SI\",\"NO\")","v":"NO"}]
[null,null,null,"IMPUESTO A LAS TRANS.FINANCIER-ITF",null,null,null,null,null,":",null,5.0000000000000002E-5,null,null,null,null,null,null,null,null,null,"Dias de gracia",{"$f":"SUMIF(B31:B127,\"PG\",G31:G127)","v":22}]
[null,null,null,null,null,null,null,null,null,null,null,null,null,null,null,null,null,null,null,null,null,"Monto gracia",{"$f":"ABS(SUMIF(B31:B127,\"PG\",J31:J127))","v":65.524005230746795}]
[null,null,null,"NRO DE CREDITO",null,null,null,null,null,":",null,{"$f":"Datos!C10","v":0}]
[null,null,null,"MONEDA",null,null,null,null,null,":",null,{"$f":"IF(Datos!D7=1,\"SOLES\",\"DOLARES\")","v":"SOLES"}]
[null,null,null,"FECHA DE DESEMBOLSO",null,null,null,null,null,":",null,{"$f":"FEC_DES","v":"2022-01-26"}]
[null,null,null,"PRIMER VENCIMIENTO",null,null,null,null,null,":",null,{"$f":"FEC_PRIMER_PAGO","v":"2022-03-17"}]
[null,null,null,"VENCIMIENTO CREDITO",null,null,null,null,null,":",null,{"$f":"EDATE(FEC_PRIMER_PAGO,PLAZO-1)","v":"2027-02-17"}]
[]
[]
[]
[null,null,null,"CRONOGRAMA DE PAGOS"]
[]
[]
[null,null,null,"NRO",null,"FEC.VCTO",null,"FACTOR","SALDO  INICIAL","AMORTIZACION","TASA TEA","INTERES","TASA SEG. DESG.","SEGURO DESGR.","TOTAL INTERES","SEGURO BIEN","COMISION","PORTES","CUOTA TOTAL","SALDO CAPIT.","SALDO CAPIT."]
[null,"PG",null,0,{"$f":"IF(TIPO_CUOTA=2,IF(OR(MONTH(F31)=8,MONTH(F31)=1),2,IF(OR(B31=\"\",B31=\"PG\"),0,1)),IF(OR(B31=\"\",B31=\"PG\"),0,1))","v":0},{"$f":"IF(Datos!D19=1,0,IF(AND(Datos!J19>0,Datos!J19<30),Datos!J18,0))","v":"2022-02-17"},{"$f":"IF(F31=0,0,F31-FEC_DES_GR)","v":22},0,{"$f":"IF(F31=0,0,Datos!K23)","v":5577},{"$f":"S31-O31","v":-65.524005230746795},{"$f":"(1+TED_0)^G31-1","v":1.1199024900245824E-2},{"$f":"I31*K31","v":62.456961868670959},{"$f":"(1+TED_1)^G31-1","v":5.4994501740646129E-4},{"$f":"I31*M31","v":3.0670433620758346},{"$f":"L31+N31","v":65.524005230746795},0,0,0,0,{"$f":"I31","v":5577},{"$f":"I31-J31","v":5642.5240052307472},null,null,null,null,null,{"$f":"IF(F31=0,-T32,-T31)","v":-5577},{"$f":"+AA31","v":-5577}]
[null,{"$f":"IF(C32<=MESES_GRACIA,\"PG\",IF(C32-MESES_GRACIA<=PLAZO,\"PP\",\"\"))","v":"PP"},1,{"$f":"IF(B32=\"PG\",0,IF(B32=\"PP\",D31+1,0))","v":1},{"$f":"IF(TIPO_CUOTA=2,IF(IF(DAY(F32)<=15,IF(OR(MONTH(F32)=8,MONTH(F32)=1),1,0),IF(OR(MONTH(F32)=7,MONTH(F32)=12),1,0)),2,IF(OR(B32=\"\",B32=\"PG\"),0,1)),IF(OR(B32=\"\",B32=\"PG\"),0,1))","v":1},{"$f":"Datos!K18","v":"2022-03-17"},{"$f":"IF(F31=0,F32-FEC_DES,F32-F31)","v":28},{"$f":"IF(OR(B32=\"PG\",B32=\"\"),0, E32*(1/(1+TED)^SUMIF(B$32:B32,\"PP\",G$32:G32)))","v":0.98524663429426573},{"$f":"IF(F31=0,Datos!K23,U31)","v":5642.5240052307472},{"$f":"S32-O32-Q32","v":63.459052741385278},{"$f":"IF(B32=\"\",0,(1+TED_0)^G32-1)","v":1.4275012395435382E-2},{"$f":"I32*K32","v":80.547100116210615},{"$f":"IF(B32=\"\",0,(1+TED_1)^G32-1)","v":6.9998250466141165E-4},3.9496680857935584,{"$f":"L32+N32","v":84.496768202004176},0,{"$f":"IF(B32=\"PP\",COMISION,0)","v":0},0,{"$f":"IF(OR(B32=\"PG\",B32=\"\"),0,(E32*CUOTA)+Q32)","v":147.95582094338945},{"$f":"I32","v":5642.5240052307472},5579.0649524893615,null,null,null,null,null,{"$f":"+S32","v":147.95582094338945},{"$f":"+IF(AA32=0,0,AA32-IF(AND(TIPO_CUOTA=2,OR(MONTH(F32)=8,MONTH(F32)=12)),2*Datos!$C$31,Datos!$C$31))","v":147.95582094338945}]
[null,"PP",2,2,1,{"$f":"EDATE(F32,1)","v":"2022-04-17"},{"$f":"IF(F32=0,F33-FEC_DES,F33-F32)","v":31},{"$f":"IF(OR(B33=\"PG\",B33=\"\"),0, E33*(1/(1+TED)^SUMIF(B$32:B33,\"PP\",G$32:G33)))","v":0.96916630910847279},{"$f":"U32","v":5579.0649524893615},{"$f":"S33-O33-Q33","v":55.390637063611678},1.5816513207667748E-2,{"$f":"I33*K33","v":88.241354507484232},7.7500968515598068E-4,4.3238293722935461,92.565183879777777,0,0,0,147.95582094338945,{"$f":"I33","v":5579.0649524893615},5523.6743154257501,null,null,null,null,null,{"$f":"+S33","v":147.95582094338945},{"$f":"+IF(AA33=0,0,AA33-IF(AND(TIPO_CUOTA=2,OR(MONTH(F33)=8,MONTH(F33)=12)),2*Datos!$C$31,Datos!$C$31))","v":147.95582094338945}]
[null,"PP",3,3,1,{"$f":"EDATE(F33,1)","v":"2022-05-17"},30,{"$f":"IF(OR(B34=\"PG\",B34=\"\"),0, E34*(1/(1+TED)^SUMIF(B$32:B34,\"PP\",G$32:G34)))","v":0.95385463440342799},{"$f":"U33","v":5523.6743154257501},59.287483815384164,1.5302419470207607E-2,{"$f":"I34*K34","v":84.525581391456669},7.4999999999625366E-4,4.1427557365486187,88.668337128005291,0,0,0,147.95582094338945,5523.6743154257501,5464.3868316103662,null,null,null,null,null,147.95582094338945,{"$f":"+IF(AA34=0,0,AA34-IF(AND(TIPO_CUOTA=2,OR(MONTH(F34)=8,MONTH(F34)=12)),2*Datos!$C$31,Datos!$C$31))","v":147.95582094338945}]
[null,"PP",4,4,1,"2022-06-17",31,{"$f":"IF(OR(B35=\"PG\",B35=\"\"),0, E35*(1/(1+TED)^SUMIF(B$32:B35,\"PP\",G$32:G35)))","v":0.93828666170776898},5464.3868316103662,57.293321731481541,1.5816513207667748E-2,{"$f":"I35*K35","v":86.427546493971079},7.7500968515598068E-4,4.2349527179368369,90.662499211907914,0,0,0,147.95582094338945,5464.3868316103662,5407.093509878885,null,null,null,null,null,147.95582094338945,{"$f":"+IF(AA35=0,0,AA35-IF(AND(TIPO_CUOTA=2,OR(MONTH(F35)=8,MONTH(F35)=12)),2*Datos!$C$31,Datos!$C$31))","v":147.95582094338945}]
[null,"PP",5,5,1,"2022-07-17",30,{"$f":"IF(OR(B36=\"PG\",B36=\"\"),0, E36*(1/(1+TED)^SUMIF(B$32:B36,\"PP\",G$32:G36)))","v":0.92346284869535855},5407.093509878885,61.15888780819671,1.5302419470207607E-2,{"$f":"I36*K36","v":82.741613002803831},7.4999999999625366E-4,4.055320132388907,86.796933135192745,0,0,0,147.95582094338945,5407.093509878885,5345.9346220706884,null,null,null,null,null,147.95582094338945,{"$f":"+IF(AA36=0,0,AA36-IF(AND(TIPO_CUOTA=2,OR(MONTH(F36)=8,MONTH(F36)=12)),2*Datos!$C$31,Datos!$C$31))","v":147.95582094338945}]
[null,"PP",6,6,1,"2022-08-17",31,{"$f":"IF(OR(B37=\"PG\",B37=\"\"),0, E37*(1/(1+TED)^SUMIF(B$32:B37,\"PP\",G$32:G37)))","v":0.90839090387754462},5345.9346220706884,59.258624277764653,1.5816513207667748E-2,84.554045557309337,7.7500968515598068E-4,4.1431511083154611,88.697196665624801,0,0,0,147.95582094338945,5345.9346220706884,5286.6759977929241,null,null,null,null,null,147.95582094338945,{"$f":"+IF(AA37=0,0,AA37-IF(AND(TIPO_CUOTA=2,OR(MONTH(F37)=8,MONTH(F37)=12)),2*Datos!$C$31,Datos!$C$31))","v":147.95582094338945}]
[null,"PP",7,7,1,"2022-09-17",31,{"$f":"IF(OR(B38=\"PG\",B38=\"\"),0, E38*(1/(1+TED)^SUMIF(B$32:B38,\"PP\",G$32:G38)))","v":0.89356495002830327},5286.6759977929241,60.241815099066415,1.5816513207667748E-2,83.61678074375186,7.7500968515598068E-4,4.0972251005711744,87.71400584432304,0,0,0,147.95582094338945,5286.6759977929241,5226.434182693858,null,null,null,null,null,147.95582094338945,{"$f":"+IF(AA38=0,0,AA38-IF(AND(TIPO_CUOTA=2,OR(MONTH(F38)=8,MONTH(F38)=12)),2*Datos!$C$31,Datos!$C$31))","v":147.95582094338945}]
[null,"PP",8,8,1,"2022-10-17",30,{"$f":"IF(OR(B39=\"PG\",B39=\"\"),0, E39*(1/(1+TED)^SUMIF(B$32:B39,\"PP\",G$32:G39)))","v":0.87944768685677466},5226.434182693858,64.058907109375568,1.5302419470207607E-2,79.977088197013074,7.4999999999625366E-4,3.9198256370008133,83.896913834013887,0,0,0,147.95582094338945,5226.434182693858,5162.3752755844826,null,null,null,null,null,147.95582094338945,{"$f":"+IF(AA39=0,0,AA39-IF(AND(TIPO_CUOTA=2,OR(MONTH(F39)=8,MONTH(F39)=12)),2*Datos!$C$31,Datos!$C$31))","v":147.95582094338945}]
[null,"PP",9,9,1,"2022-11-17",31,{"$f":"IF(OR(B40=\"PG\",B40=\"\"),0, E40*(1/(1+TED)^SUMIF(B$32:B40,\"PP\",G$32:G40)))","v":0.86509411862694763},5162.3752755844826,62.304153377182303,1.5816513207667748E-2,81.650776729219402,7.7500968515598068E-4,4.0008908369877485,85.651667566207152,0,0,0,147.95582094338945,5162.3752755844826,5100.0711222073005,null,null,null,null,null,147.95582094338945,{"$f":"+IF(AA40=0,0,AA40-IF(AND(TIPO_CUOTA=2,OR(MONTH(F40)=8,MONTH(F40)=12)),2*Datos!$C$31,Datos!$C$31))","v":147.95582094338945}]
{"$rows_left_out":104}